{"text_format":"1","workbook":"xlsx","n_sheets":10,"sheets":["Instructions","Organization Profile","Organizational Management","Technical Competency","Networking,Collab & Co-Creation","Evidence Uptake","Dataset","Dashboard","FAQs","Data processing"],"not_rendered":{"charts":48,"images":7,"macros":1,"external_links":0,"defined_names":23,"comments":0,"pivot_tables":16},"unopened":[],"bounds":{"document_bytes":16777216,"sheet_cells":100000,"rows_first":2000,"rows_last":500,"rows_between":2000,"halvings":0,"cell_chars":16384,"cell_head_chars":4096},"cells_cut":0,"cells_raw":0,"read":"whole","date_system":"1900"}

{"sheet":"Instructions","index":0,"n_rows":16,"n_cols":3,"rows_kept":16,"cut":false,"hidden":false,"merged":[]}
[]
[null,null,"Health Policy and System Research Institutions"]
[null,null,"Capacity Assessment Tool"]
[]
[null,null,"Introduction to the Tool"]
[null,null,"This framework has been thoughtfully developed to assist institutions in quickly evaluating their capacity for conducting robust research and evaluations. Its primary purpose is to help organizations identify areas of improvement and prioritize their development efforts. We understand that conducting robust research and evaluations is vital for evidence-based decision-making, and our tool is here to support Health Policy and System Research Institutions (HPSRIs) in achieving this goal. Reading through the following.  section will provide you with a deeper understanding of the framework's purpose, development process, and the benefits it can bring to your organization."]
[null,null,"\nPurpose and scope"]
[null,null,"The goal of this assessment tool is to promote reflective self-assessment and facilitate a culture of learning within your organization. The Capacity Assessment framework is designed to evaluate an organization's capacity on Health Policy and System Research (HPSR) and the evidence from assessment can be used to identify areas for improvement, prioritize capacity development efforts and evaluate the progress over time. These institutions may include private or non-governmental organizations, academic institutions and government agencies that are primarily engaged with HPSR. By embracing this self-assessment process, you can continuously enhance your organization's research and evaluation practices, leading to evidence-informed decision-making and improved health policy and system outcomes."]
[null,null,"\nAssessment Process"]
[null,null,"Honesty and objectivity are paramount when completing this assessment. We encourage you to accurately reflect your organization's capacity without any bias or exaggeration. Take your time to carefully consider your answers and provide thoughtful and detailed responses for each competency. This will ensure a comprehensive and accurate assessment of your organization's capacity. Before submitting the tool, review your responses to ensure completeness and accuracy, answering all questions fully and providing accurate scores and remarks."]
[null,null,"\nAppropriate People for Completing the Tool"]
[null,null,"This tool should be completed by appropriate personnel within your organization. It is ideal to have representatives from different areas such as research, finance, administration, HR, and operations teams among others. By involving individuals with knowledge and expertise in various aspects of your organization, you can ensure a more comprehensive and accurate assessment. Having both management and technical staff present for all domains can serve as an important learning activity and increase awareness of how the organization functions together."]
[null,null,"\nTool Adaptability"]
[null,null,"We understand that each organization is unique, and priorities may vary. Therefore, the Capacity Assessment Tool is designed to be adaptable. You have the flexibility to select specific domains or subdomains based on your organization's needs. Modify the tool as necessary to align with your requirements, ensuring that it captures the essence of your organization's capacity and performance accurately."]
[null,null,"\nMeasure of Capacity "]
[null,null,"Capacity of the organizations will be measured in terms of basic capacity, medium capacity, and advanced capacity.  \n\nBasic capacity/skills: The research staffs or organization possesses limited to no capability to carry out the health policy and system research related activities and requires technical support and supervision through the research process.\n\nMedium Capacity/ skills: The research staffs or organization is fully equipped to assume primary responsibility for the activity, proficiently managing the majority of components or steps of the health policy and system research. They locate or take support from relevant expert in market if any assistance is needed. Technical support is only required to offer backing, supervision, and to address any residual capacity gaps. Additionally, it offers supplementary guidance and support, particularly for crafting new materials and addressing novel, rare, or unexpected circumstances.\n\nAdvanced capacity/skills: The research staffs or organization has achieved a high level of competence to successfully conceptualize, execute and accomplish the health policy and system research related activities complying with acceptable or high quality standards. While they might still engage an international expert for exceptionally technical tasks or for validation, guidance, or supervision, they no longer require technical support or guidance for any aspect of the activity's implementation.\n\n**Note: The option to select basic,medium or advanced might still appear when you select no for certain practices or processes. This is because the organizational may have the capacity to conduct certain activities or processes but might not be currently practicing them. "]

{"sheet":"Organization Profile","index":1,"n_rows":45,"n_cols":16,"rows_kept":45,"cut":false,"hidden":false,"merged":[[2,1,2,7],[33,4,33,7]]}
[]
[]
[null,"PART-I: Organizational profile "]
[]
[null,"P1 ","Name of the Organization"]
[]
[null,"P2","Location of head office (Province)"]
[]
[null,"P3","Nature of organization "]
[]
[null,"P3.1","If other, specify"]
[]
[null,"P4","Area of work"]
[null,"P4.1","Offering educational degrees"]
[null,"P4.2","Conducting training for research or capacity development"]
[null,"P4.3","Policy making"]
[null,"P4.4","Programme implementation"]
[null,"P4.5","Generating evidence/ conducting research"]
[null,"P4.6","Service delivery"]
[null,"P4.7","Knowledge brokering/research communication"]
[null,"P4.8.1","If other specify: "]
[null,"P4.8.2","If other specify: "]
[null,"P4.8.3","If other specify: "]
[]
[null,"P5","Staff in the organization"]
[null,"P5.1","Number of part-time staff"]
[null,"P5.2","Number of full-time staff"]
[]
[null,"P6","Number of staffs by type"]
[null,"P6.1","Leadership position such as Director/Executive officers/Senior level managers (looking at overall management of organization "]
[null,"P6.2","Number of Admin and finance staff"]
[null,"P6.3","Number of research staff"]
[null,"P6.4","Number of support staff"]
[null,"P6.5","Total number of staff",{"$f":"SUM(D26:D27)","v":0},{"$f":"IF(ISBLANK(D33), \"\", IF(P34=TRUE,\"\", \"This total number of staff doesn’t match\"))","v":""},null,null,null,null,null,null,null,null,null,null,{"$f":"SUM(D26:D27)=SUM(D30:D33)","v":true}]
[]
[null,"P7","Does your organization hire external experts/ consultants to provide technical support in specific area of work?"]
[]
[]
[null,"P8","Availability of basic amenities/ services"]
[null,"P8.1","Sufficient workspace for staff"]
{"$rows_left_out":6}
{"sheet":"Organizational Management","index":2,"n_rows":90,"n_cols":5,"rows_kept":90,"cut":false,"hidden":false,"merged":[[0,0,0,4],[2,0,2,1],[82,0,83,0],[81,0,81,4],[49,0,49,4],[63,0,63,4],[5,3,9,4]]}
["Domain 1: Organizational management"]
[]
["Subdomain 1: Policy environment in the organization"]
["S.No","Organizational policies/ mechanisms\n[Column B]","O1.1 Does your organization have the following policy documents that clearly spell the following components of organizational management or have specified system in functional state?","O 1.2 When was the last time the policy, guidelines, plans, mechanisms updated (in years ago)","O 1.3 What is the implementation status of policies, policy provisions, guidelines or plans listed in column B?"]
["O1.1"]
["O1.1.1","Vision Statement"]
["O1.1.2","Mission Statement"]
["O1.1.3","Organogram"]
["O1.1.4","Scope of work"]
["O1.1.5","Clear communication channels (clarity on whom to communicate based on nature of issue)"]
["O1.1.6","Risk management policy outlining strategies for identification, proritization and mitigation of potential risk to employees"]
["O1.1.7","Whistleblowing policy (for reporting of suspected misconduct, financial fraud and other  illegal acts)"]
["O1.1.8","Policies for the protection of Intellectual Property (IP) "]
["O1.1.9","Policy outlining organizations strategies for organizational growth and development (the business development policy)"]
["O1.1.10","Mechanisms for continuous engagement with policy makers or programme implementers"]
[]
["O1.3","HR management "]
["O1.2.1","Policy outlining strategies for recruitment of competent professionals from market"]
["O1.2.1","Policy outlining strategies for rretention of qualified professionals/staffs"]
["O1.2.2","Policies/guideline/plan for capacity development"]
["O1.2.3","Mechanism for performance appraisal"]
["O1.2.4","Gender and social inclusion policy"]
[]
[]
["O1.3","Infrastructures, logistics and procurement"]
["O1.3.1","Functional inventory management system"]
["O1.3.2","Policies guiding process for procurement of necessary goods and equipment"]
[]
["O1.4","Ethical conduct of research"]
["O1.4.1","Guidelines or standard operating procedures for research ethics (depending on country context, organization may adopt national ethical guideline without having separate policy. In that case, organization should respond Yes in Column C)"]
["O1.4.2","A focal person or unit for ethical matters in research  within the organization"]
["O1.4.3","A mechanism for investigation on violation of research ethics in research projects undertaken by your organization aligning with national ethical guidelines"]
["O1.4.4","Infrastructure/server for safely storing participants details or confidential information relating to research"]
["O1.4.5","Policy for storage and disposal of participants details or other confidential information relating to research"]
["O1.4.6","Protection policies or guidelines for the researcher"]
["O1.4.7","Policy or provisions regarding to insurance for researchers"]
[]
["O1.5","Privacy and confidentiality (other than research ethics)"]
["O1.5.1","System for classifying document as sensitive and non-sensitive"]
["O1.5.2","Written document on naming convention for files and storage provisions"]
{"$rows_left_out":51}
{"sheet":"Technical Competency","index":3,"n_rows":181,"n_cols":6,"rows_kept":181,"cut":false,"hidden":false,"merged":[[169,0,169,6],[170,0,171,6],[135,0,135,6],[151,0,151,6],[152,0,152,6],[153,0,153,6],[168,0,168,6],[137,3,137,4],[133,0,133,6],[134,0,134,6],[72,2,72,3],[68,0,68,6],[69,0,69,6],[82,0,82,6],[83,0,83,6],[84,0,84,6],[120,0,120,6],[100,0,100,6],[101,0,101,6],[102,0,102,6],[121,0,121,6],[123,3,123,4],[53,2,54,2],[0,0,0,6],[119,0,119,6],[1,0,1,5],[2,0,2,5],[53,3,54,4],[72,4,72,5],[104,3,104,4],[86,3,86,4]]}
["Domain 2: Technical Competency"]
["Domain 2 of your assessment investigates the technical competency of your organization. It scrutinizes various dimensions of technical expertise and capabilities within your research team, encompassing education, methodological expertise, specific technical skills, and experience. This domain aims to provide a thorough understanding of the proficiency levels and qualifications of your research staff, ensuring they possess the essential skills required for conducting high-quality health policy and systems research. It involves sub-domains such as ethics and safeguarding, research conceptualization, literature review, referencing and citation, research design and methods, research implementation, data management and analysis, technical writing and dissemination and quality check mechanism, monitoring and evaluation. "]
["Instruction: In the table below, please indicate the number of research staff with specified educational level, methodological expertise, specific technical skills and experience.  "]
[]
["T1.1","Education","Number of staffs "]
[null,"Certificate level courses"]
[null,"Bachelor or below"]
[null,"Master"]
[null," PhD /Post-doc"]
["T 1.2. ","How many researchers do you have with the following background or expertise, as specified below.","Number of staffs "]
[null,"Medicine/ dentistry"]
[null,"Epidemiology"]
[null,"Pharmacy"]
[null,"Nursing"]
[null,"Veterinary"]
[null,"Public health"]
[null,"Data science/ Statistics"]
[null,"Environment"]
[null,"Economics"]
[null,"Sociology/ Anthropology"]
[null,"Political science"]
[null,"Communication"]
[null,"Others, please specify: "]
[null,"Others, please specify: "]
[null,"Others, please specify: "]
[]
[]
["T 1.2. ","Methodological expertise"]
[null,"Quantitative studies"]
[null,"Qualitative studies"]
[null," Mixed method studies"]
["T 1.3 ",null,"T 1.3 Does your organization staffs with expertise in following area of research","T 1.4 Does your organization undertake the research/analysis specified in Column C, row 32 to 42?","T 1.5 If yes in question, T 1.3, specify the number of research undertaken in last 5 years"]
[null,"Implementation research"]
[null,"Operational research"]
[null,"Tool development and validation studies"]
[null,"Policy analysis"]
[null,"Cost estimation/economic evaluations"]
[null,"Scoping review/ narrative review"]
[null,"Systematic review/Meta analysis"]
[null,"Undertaking large scale surveys"]
{"$rows_left_out":142}
{"sheet":"Networking,Collab & Co-Creation","index":4,"n_rows":57,"n_cols":5,"rows_kept":57,"cut":false,"hidden":false,"merged":[[1,0,1,4],[48,3,48,4],[2,0,2,4],[46,0,46,4]]}
[]
["Domain 3: Networking, Collaboration and Co-creation"]
["Domain 3 of your assessment focuses on the critical aspects of networking, collaboration, and co-creation within your research organization. It investigates your organization's ability to establish and maintain meaningful partnerships and collaborations with a variety of stakeholders. Additionally, this domain explores how effectively your organization engages with these stakeholders to co-create knowledge and influence policy and practice. It investigates subdomains such as stakeholder engagement, inter-sectoral collaboration, networking, and co-creation among others."]
[]
["N 1.1","Does your organization partner or collaborate with the following type of institutions/organizations in jointly managing or implementing the research projects?","Select the appropriate response from the dropdown menu"]
[null,"Government bodies"]
[null,"Academic institutions within country"]
[null,"Academic institutions outside country"]
[null,"Research organizations within country"]
[null,"Research organizations outside country"]
[null,"Local organizations in study site (may overlap with research organizations above)"]
[null,"Other (please specify) "]
[]
["N 1.2","Does your organization engage following stakeholders in co-creation process in research projects?"]
[null,"Government stakeholders/policymakers"]
[null,"Local community/ community representatives"]
[null,"Academia"]
[null,"NGOs/CSOs/charity organizations"]
[null,"Private organizations"]
[null,"Public hospitals/health facilities/ service delivery units"]
[null,"Private hospitals/health facilities/ service delivery units"]
[null,"Other (please specify) "]
[]
["N 1.3","How does your organization prioritize stakeholders for engagement?\n \n"]
[null,"By relevance to the research topics"]
[null,"Based on power they possess in influencing policy/programme decisions"]
[null,"By funding availability"]
[null,"Business portfolio/ goodwill of the organization"]
[null,"Other (please specify)"]
[]
["N 1.4 ","In undertaking the research projects, does your organization engage stakeholders from sectors other than health?"]
["N1.4.1","Agriculture"]
["N1.4.2","Environment"]
["N1.4.3","Infrastructure development (Including road, water supply, sewage system etc.)"]
["N1.4.4","Livlihood / employment/ household economy"]
["N1.4.5","Other (please specify)"]
[]
["N 1.6","What are the major challenges your organization faces when engaging stakeholders? "]
["N1.6.1","Limited stakeholder interest"]
["N1.6.2","Limited participation of stakeholders"]
{"$rows_left_out":18}
{"sheet":"Evidence Uptake","index":5,"n_rows":68,"n_cols":6,"rows_kept":68,"cut":false,"hidden":false,"merged":[[0,0,0,5],[1,0,1,5]]}
["Domain 4: Evidence to Policy Translation"]
["Domain 4 of your assessment evaluates your organization's ability to translate research into practical policies and practices. This domain covers subdomains such as policy and guideline framework, peer review of research outputs, adapting findings to the local context, production of knowledge products, effective communication channels, tailored advocacy efforts, mechanisms for policy influence, response time to policy requests, and barriers to translation. It aims to assess your organization's policies, development of knowledge product, advocacy and policy influence mechanisms, and challenges in the translation process among several other key aspects."]
[]
["P 1","Knowledge products","P 1.1 Which of the following knowledge products does your organization produce?","P 1.2 What is the number of products developed/ event organized (specified from column B, Row 5 to 13)","P 1.3 How do you rate your organizational competency in developing the specified knowledge products or organizing events specified?","P 1.4 Justification"]
["a","Policy briefs/ project briefs tailored to the need of policy makers/ programme implementers"]
["b","Prepare non-technical summary of the research findings in national/local language "]
["c","Discussion papers"]
["d","Newspaper articles"]
["e","Blog post"]
["f","Infographics "]
["g","Video summary of the research findings"]
["h","Scientific papers"]
["i","Other (Please specify): "]
["i","Other (Please specify): "]
["i","Other (Please specify): "]
[]
["P2","Events","How often does your institution organize knowledge sharing or dissemination events specified ? Question for Column C","P 2.2 What is the number of knowledge sharing or dissemination events organized by your organization in past one year? Column D","P 2.3 How do you rate your organizational competency in organizing knowledge sharing/ dissemination events specified? Column E","P 2.4 Justification for assigning specific rating on competency in Column E (Column F)"]
["a","Webinars and seminars to share the learnings"]
["b","Social media campaigns based on findings from evidence generated"]
["c","Interaction/ discussion with policy makers about evidence and their applicability"]
["d","Organize dissemination events with local stakeholders/beneficiaries "]
["e","Organize dissemination events with policy makers and other stakeholders at policy making level"]
["f","Organize dissemination events with policy makers and other stakeholders at programme implementing level"]
["g","Document the impact and effectiveness of HPSR programs in influencing policy decisions and healthcare outcomes"]
["h","Deliver presentations at national level conferences, seminars, summits etc."]
["i","Deliver presentations at international level conferences, seminars and summits "]
["j","Organize events/ discussions responding to the evidence gap highlighted or evidence requested by policy makers/ programme implementers"]
[null,null,"Yes",null,"NA "]
["P 1.2 ","Which communication channels have been most effective for your organization in bridging the gap between research and practice?","Yes",null,"Basic "]
[null,"Policy briefs","Yes",null,"Medium "]
[null,"Webinars and seminars","Yes",null,"Advanced "]
[null,"Social media campaigns","Yes",null,"NA "]
[null,"One-on-one consultations","Yes",null,"Basic "]
[null,"Other (please specify)","Yes",null,"Medium "]
[null,null,"Yes",null,"Advanced "]
[null,null,"Yes",null,"NA "]
["P 1.3"," In what ways does your organization tailor advocacy efforts to influence specific policies or stakeholder groups?","Yes",null,"Basic "]
[null,"Customized policy briefs","Yes",null,"Medium "]
[null,"Targeted engagement with key policymakers","Yes",null,"Advanced "]
[null,"Grassroots advocacy campaigns","Yes",null,"NA "]
{"$rows_left_out":29}
{"sheet":"Dataset","index":6,"n_rows":717,"n_cols":16,"rows_kept":717,"cut":false,"hidden":true,"merged":[]}
["Number of staffs"]
[null,{"$f":"'Organization Profile'!C26:D33","v":"Number of part-time staff"},0]
[null,"Number of full-time staff",0]
[null,0,0]
[null,"Number of staffs by type",0]
[null,"Leadership position such as Director/Executive officers/Senior level managers (looking at overall management of organization ",0,"Leadership Position",{"$f":"C6:C9","v":0}]
[null,"Number of Admin and finance staff",0,"Admin and Finance",0]
[null,"Number of research staff",0,"Research staff",0]
[null,"Number of support staff",0,"Support staff",0]
[]
[]
[null,null,"Availability","items"]
[null,{"$f":"'Organization Profile'!C14:D21","v":"Offering educational degrees"},0,{"$f":"IF(C13=\"Yes\", B13,\"\")","v":""}]
["Area of work","Conducting training for research or capacity development",0,{"$f":"IF(C14=\"Yes\", B14,\"\")","v":""}]
[null,"Policy making",0,""]
[null,"Programme implementation",0,""]
[null,"Generating evidence/ conducting research",0,""]
[null,"Service delivery",0,""]
[null,"Knowledge brokering/research communication",0,""]
[null,"If other specify: ",0,""]
[null,null,null,""]
[]
[]
[]
[]
[]
[]
[]
["Availability of amenities"]
[null,{"$f":"'Organization Profile'!C40:D45","v":"Sufficient workspace for staff"},0,null,{"$f":"B30","v":"Sufficient workspace for staff"},{"$f":"VLOOKUP(C30,'Data processing'!$A$1:$B$13,2,)","v":{"$error":"#N/A"}}]
[null,"Continuous electricity supply",0,null,{"$f":"B31","v":"Continuous electricity supply"},{"$f":"VLOOKUP(C31,'Data processing'!$A$1:$B$13,2,)","v":{"$error":"#N/A"}}]
[null,"Laptop in the ratio of 1:1 for staffs engaged in table works",0,null,"Laptop in the ratio of 1:1 for staffs engaged in table works",{"$f":"VLOOKUP(C32,'Data processing'!$A$1:$B$13,2,)","v":{"$error":"#N/A"}}]
[null,"Electricity backup",0,null,"Electricity backup",{"$f":"VLOOKUP(C33,'Data processing'!$A$1:$B$13,2,)","v":{"$error":"#N/A"}}]
[null,"Uninterrupted internet service during office hours",0,null,"Uninterrupted internet service during office hours",{"$f":"VLOOKUP(C34,'Data processing'!$A$1:$B$13,2,)","v":{"$error":"#N/A"}}]
[null,"Drinking water supply",0,null,"Drinking water supply",{"$f":"VLOOKUP(C35,'Data processing'!$A$1:$B$13,2,)","v":{"$error":"#N/A"}}]
[]
[null,null,null,null,"count_errror",{"$f":"COUNTIF(F30:F35, \"#N/A\")","v":6}]
[null,null,null,null,"Score",{"$f":"SUMIF(F30:F35,\"<>#N/A\")","v":0}]
[null,null,null,null,"Total count",{"$f":"6-F37","v":0}]
[null,null,null,null,"Percent",{"$f":"F38/F39*100","v":{"$error":"#DIV/0!"}}]
{"$rows_left_out":678}
{"sheet":"Dashboard","index":7,"n_rows":350,"n_cols":11,"rows_kept":350,"cut":false,"hidden":false,"merged":[]}
[]
[]
[]
[]
[]
[]
[]
[]
[]
[]
[]
[]
[]
[]
[]
[]
[]
[]
[]
[]
[]
[]
[]
[]
[]
[]
[]
[]
[]
[]
[]
[]
[]
[]
[]
[]
[]
[]
[]
[]
{"$rows_left_out":311}
{"sheet":"FAQs","index":8,"n_rows":4,"n_cols":3,"rows_kept":4,"cut":false,"hidden":false,"merged":[]}
["SN","FAQs","Asnswer"]
[1,"Why my dashboard is not updated ?","It is because you have not refereshed the dashboard. You can refresh dashboard by clicking the \"Refresh Dashboard\" button"]
[2,"Why it displays error on clicking \"Refresh Dashboard\"? And How to solve this issue","In the beginning, you have not enabled \"MACROS\" in your excel sheet because of which the macros is not able to load. To solve this issue, you first need to go to \"File\"  >> \"OPTIONS\" >>  \"TRUST CENTER\"  >> \"TRUST CENTER SETTING\" >>  \"MACROS SETTING\" >>  Select \" \"Enable VBA macros\", put check mark to \"enable Excel 4.0 macros when VBA macros enabled\"  and put check mark to \"TRUST access ot the VBA project object model\""]
[3,"Even if Macros is enabled why is the dasboard not syncing?","Close the file. Right click >> Show more options or >> Properties >> Unblock >> Apply >> Ok and open the file again"]

{"sheet":"Data processing","index":9,"n_rows":21,"n_cols":9,"rows_kept":21,"cut":false,"hidden":true,"merged":[]}
["Category 1 ",null,null,null,"Yes","No",null,"Yes_","No_"]
["Available",1,null,null,"Basic ","Not Applicable",null,"Fully implemented","Not applicable"]
["Not available ",0,null,null,"Medium ","Basic ",null,"Partially implemented"]
[null,null,null,null,"Advanced ","Medium ",null,"Not implemented"]
["Category 2",null,null,null,null,"Advanced "]
["Yes",1]
["No",0]
[]
["Rate No"]
["NA ",0]
["Basic ",1]
["Medium ",2]
["Advanced ",3]
[]
[]
[]
[]
[]
[]
[]
[null,null,"Partially implemented","Not Implemented"]